BDBM50500902 CHEMBL3798452
SMILES Clc1ccc(CNc2ccnc(n2)N2CCC3(CCN(C[C@@H]4CCCN4)C3)CC2)c(Cl)c1
InChI Key InChIKey=ZALVCIBELBSJOR-FQEVSTJZSA-N
Data  1 KI  1 EC50
  Tab Delimited (TSV)   2D SDfile   Computed 3D by Vconf -m prep SDfile
Find this compound or compounds like it in BindingDB:
Activity Spreadsheet -- Enzyme Inhibition Constant Data from BindingDB
Found 2 hits for monomerid = 50500902
TargetC-C chemokine receptor type 4(Homo sapiens (Human))
Glaxosmithkline Medicines Research Centre
Curated by ChEMBL
LigandPNGBDBM50500902(CHEMBL3798452)
Affinity DataKi:  4nM. Assay description: Displacement of [125I]-TARC from human recombinant CCR4 expressed in CHO cell membranes by scintillation counting method
Ligand InfoPC cidPC sid
In DepthDetails ArticlePubMed
TargetC-C chemokine receptor type 4(Homo sapiens (Human))
Glaxosmithkline Medicines Research Centre
Curated by ChEMBL
LigandPNGBDBM50500902(CHEMBL3798452)
Affinity DataEC50:  13nM. Assay description: Induction of CCR4 internalisation in human HUT78 cells after 30 mins by flow cytometry
Ligand InfoPC cidPC sid
In DepthDetails ArticlePubMed