BDBM50501528 CHEMBL4066625
SMILES CCCCCCCNc1nc(NC2CCN(C)CC2)c2cc(OC)c(OC)cc2n1
InChI Key InChIKey=GQJJJDCHUVVIMA-UHFFFAOYSA-N
Data  2 IC50
  Tab Delimited (TSV)   2D SDfile   Computed 3D by Vconf -m prep SDfile
Find this compound or compounds like it in BindingDB:
Activity Spreadsheet -- Enzyme Inhibition Constant Data from BindingDB
Found 2 hits for monomerid = 50501528
TargetHistone-lysine N-methyltransferase EHMT1(Homo sapiens (Human))
Icahn School Of Medicine At Mount Sinai
Curated by ChEMBL
LigandPNGBDBM50501528(CHEMBL4066625)
Affinity DataIC50:  44nM. Assay description: Inhibition of recombinant GLP catalytic SET domain (982 to 1266 residues) (unknown origin) expressed in Escherichia coli BL21 (DE3) codon plus RIL as...
Ligand InfoPC cidPC sid
In DepthDetails ArticlePubMed
TargetHistone-lysine N-methyltransferase EHMT2(Homo sapiens (Human))
Icahn School Of Medicine At Mount Sinai
Curated by ChEMBL
LigandPNGBDBM50501528(CHEMBL4066625)
Affinity DataIC50:  756nM. Assay description: Inhibition of recombinant G9a catalytic SET domain (913 to 1193 residues) (unknown origin) expressed in Escherichia coli BL21 (DE3) codon plus RIL as...
Ligand InfoPC cidPC sid
In DepthDetails ArticlePubMed