BDBM50501778 CHEMBL4098674
SMILES C[C@@H](O)[C@H](NC1COCc2cc(ccc12)C#Cc1ccccc1)C(=O)NO
InChI Key InChIKey=LPDBAQYTFCNGSP-XKCBZBSRSA-N
Data  2 IC50
  Tab Delimited (TSV)   2D SDfile   Computed 3D by Vconf -m prep SDfile
Find this compound or compounds like it in BindingDB:
Activity Spreadsheet -- Enzyme Inhibition Constant Data from BindingDB
Found 2 hits for monomerid = 50501778
TargetUDP-3-O-acyl-N-acetylglucosamine deacetylase(Escherichia coli)
Cubist Pharmaceuticals
Curated by ChEMBL
LigandPNGBDBM50501778(CHEMBL4098674)
Affinity DataIC50:  2nM. Assay description: Inhibition of LpxC in Escherichia coli isolate 35 ATCC 25922
Ligand InfoPC cidPC sid
In DepthDetails ArticlePubMed
TargetUDP-3-O-acyl-N-acetylglucosamine deacetylase(Pseudomonas aeruginosa)
Cubist Pharmaceuticals
Curated by ChEMBL
LigandPNGBDBM50501778(CHEMBL4098674)
Affinity DataIC50:  14nM. Assay description: Inhibition of LpxC in Pseudomonas aeruginosa isolate 44 ATCC 27853
Ligand InfoPC cidPC sid
In DepthDetails ArticlePubMed