BDBM50502333 CHEMBL4466041
SMILES O=C(Cc1c(oc2ccc3ccccc3c12)C#C)Oc1ccc(cc1)-c1nnco1
InChI Key InChIKey=JIOJOUNXAWDVTH-UHFFFAOYSA-N
Data  1 IC50
  Tab Delimited (TSV)   2D SDfile   Computed 3D by Vconf -m prep SDfile
Find this compound or compounds like it in BindingDB:
Activity Spreadsheet -- Enzyme Inhibition Constant Data from BindingDB
Found 1 hit for monomerid = 50502333
TargetATP-dependent Clp protease proteolytic subunit, mitochondrial(Homo sapiens)
University Of Toronto
Curated by ChEMBL
LigandPNGBDBM50502333(CHEMBL4466041)
Affinity DataIC50:  390nM. Assay description: Inhibition of C-terminal recombinant human ClpP expressed in Escherichia coli Rosetta2 (DE3) cells using Suc-Leu-Tyr-AMC as substrate incubated for 1...
Ligand InfoPC cidPC sid
In DepthDetails ArticlePubMed