BDBM50502585 CHEMBL4446248
SMILES OC(=O)CC12CCC(CC1)(CO2)c1ccc(cc1)-c1ccc(Nc2nnc(o2)C2CCC2)cc1
InChI Key InChIKey=IGLDKUZNVAQKJM-UHFFFAOYSA-N
Data  1 IC50  1 EC50
  Tab Delimited (TSV)   2D SDfile   Computed 3D by Vconf -m prep SDfile
Find this compound or compounds like it in BindingDB:
Activity Spreadsheet -- Enzyme Inhibition Constant Data from BindingDB
Found 2 hits for monomerid = 50502585
TargetDiacylglycerol O-acyltransferase 1(Homo sapiens (Human))
Novartis Institutes For Biomedical Research
Curated by ChEMBL
LigandPNGBDBM50502585(CHEMBL4446248)
Affinity DataIC50:  83nM. Assay description: Inhibition of recombinant human his-tagged DGAT1 expressed in Sf9 insect cells using oleoyl-CoA and diolein as substrates incubated for 30 mins by LC...
Ligand InfoPC cidPC sid
In DepthDetails ArticlePubMed
TargetDiacylglycerol O-acyltransferase 1(Mus musculus (mouse))
Novartis Institutes For Biomedical Research
Curated by ChEMBL
LigandPNGBDBM50502585(CHEMBL4446248)
Affinity DataEC50:  12nM. Assay description: Inhibition of DGAT1 in mouse C2C12 cells assessed as reduction in intracellular triglyceride production incubated for 2 hrs in presence of BSA-comple...
Ligand InfoPC cidPC sid
In DepthDetails ArticlePubMed