BDBM50503289 CHEMBL4462220
SMILES FC(F)(F)Oc1cccc(CC(=O)Nc2ccc(nn2)N2CCCC(C2)c2nnc(NC(=O)Cc3ccccn3)s2)c1
InChI Key InChIKey=BUOKPUIUIDQFFG-UHFFFAOYSA-N
Data  1 IC50
  Tab Delimited (TSV)   2D SDfile   Computed 3D by Vconf -m prep SDfile
Find this compound or compounds like it in BindingDB:
Activity Spreadsheet -- Enzyme Inhibition Constant Data from BindingDB
Found 1 hit for monomerid = 50503289
TargetGlutaminase kidney isoform, mitochondrial(Mus musculus)
TBA
Curated by ChEMBL
LigandPNGBDBM50503289(CHEMBL4462220)
Affinity DataIC50:  50nM. Assay description: Inhibition of mouse kidney glutaminase assessed as ammonia formation at 0.1 uM using glutamine as substrate by Nessler's reagent based assay relative...
Ligand InfoPC cidPC sid
In DepthDetails ArticlePubMed