BDBM50504750 CHEMBL4536202
SMILES COC(=O)c1nn(-c2ccc(cc2)S(N)(=O)=O)c2nc3cc(cc(-c4ccc(cc4)[N+]([O-])=O)c3c(=O)n12)-c1cccs1
InChI Key InChIKey=WVSXMOPMPWDBBI-UHFFFAOYSA-N
Data  1 KI
  Tab Delimited (TSV)   2D SDfile   Computed 3D by Vconf -m prep SDfile
Find this compound or compounds like it in BindingDB:
Activity Spreadsheet -- Enzyme Inhibition Constant Data from BindingDB
Found 1 hit for monomerid = 50504750
TargetCarbonic anhydrase 9(Homo sapiens (Human))
Egyptian Russian University
Curated by ChEMBL
LigandPNGBDBM50504750(CHEMBL4536202)
Affinity DataKi:  0.160nM. Assay description: Inhibition of recombinant human carbonic anhydrase-9 incubated for 15 mins by stopped flow CO2 hydrase assay
Ligand InfoPC cidPC sid
In DepthDetails ArticlePubMed