BDBM50505378 CHEMBL4558553
SMILES [H][C@@]12CC(CCCCCC)=C(c3ccccc3)[C@@]1(CC[C@H]2O)C(=C)Cc1ccccc1
InChI Key InChIKey=YYCBRMOICJLJDK-GKRYNVPLSA-N
Data  1 EC50
  Tab Delimited (TSV)   2D SDfile   Computed 3D by Vconf -m prep SDfile
Find this compound or compounds like it in BindingDB:
Activity Spreadsheet -- Enzyme Inhibition Constant Data from BindingDB
Found 1 hit for monomerid = 50505378
TargetNuclear receptor subfamily 5 group A member 2(Homo sapiens (Human))
Emory University School Of Medicine
Curated by ChEMBL
LigandPNGBDBM50505378(CHEMBL4558553)
Affinity DataEC50:  800nM. Assay description: Agonist activity at human full length LRH1 transfected in human HeLa cells incubated for 24 hrs by renilla luciferase reporter gene assay
Ligand InfoPC cidPC sid
In DepthDetails ArticlePubMed