BDBM50505775 CHEMBL4442651
SMILES Cc1ccccc1NC(=O)N1CCC[C@H]1C(O)=O
InChI Key InChIKey=UEDXMRKTOKTYSH-NSHDSACASA-N
Data  3 IC50  3 EC50
  Tab Delimited (TSV)   2D SDfile   Computed 3D by Vconf -m prep SDfile
Find this compound or compounds like it in BindingDB:
Activity Spreadsheet -- Enzyme Inhibition Constant Data from BindingDB
Found 6 hits for monomerid = 50505775
TargetIntegrin alpha-4/beta-1(Homo sapiens (Human))
University Of Bologna
Curated by ChEMBL
LigandPNGBDBM50505775(CHEMBL4442651)
Affinity DataEC50:  10nM. Assay description: Agonist activity at alpha4beta1 integrin receptor in human Jurkat E6.1 cells assessed as increase in VCAM1-induced cell adhesion pre-incubated for 30...
In DepthDetails ArticlePubMed
TargetIntegrin alpha-5/beta-1(Homo sapiens (Human))
University Of Bologna
Curated by ChEMBL
LigandPNGBDBM50505775(CHEMBL4442651)
Affinity DataEC50:  140nM. Assay description: Agonist activity at alpha5beta1 integrin receptor in human K562 cells assessed as increase in fibronectin-induced cell adhesion pre-incubated for 30 ...
In DepthDetails ArticlePubMed
TargetIntegrin alpha-V/beta-3(Homo sapiens (Human))
University Of Bologna
Curated by ChEMBL
LigandPNGBDBM50505775(CHEMBL4442651)
Affinity DataIC50: >1.00E+3nM. Assay description: Binding affinity to alphaVbeta3 integrin receptor (unknown origin) incubated fro 30 mins by competitive solid-phase binding assay
In DepthDetails ArticlePubMed
TargetIntegrin alpha-5/beta-1(Homo sapiens (Human))
University Of Bologna
Curated by ChEMBL
LigandPNGBDBM50505775(CHEMBL4442651)
Affinity DataIC50:  136nM. Assay description: Binding affinity to alpha5beta1 integrin receptor (unknown origin) incubated fro 30 mins by competitive solid-phase binding assay
In DepthDetails ArticlePubMed
TargetIntegrin alpha-4/beta-1(Homo sapiens (Human))
University Of Bologna
Curated by ChEMBL
LigandPNGBDBM50505775(CHEMBL4442651)
Affinity DataIC50:  19nM. Assay description: Binding affinity to alpha4beta1 integrin receptor (unknown origin) incubated for 1 hr by scintillation proximity binding assay
In DepthDetails ArticlePubMed
TargetIntegrin alpha-V/beta-3(Homo sapiens (Human))
University Of Bologna
Curated by ChEMBL
LigandPNGBDBM50505775(CHEMBL4442651)
Affinity DataEC50:  2.88E+3nM. Assay description: Agonist activity at alphaVbeta3 integrin receptor in human SK-MEL-24 cells assessed as increase in fibronectin-induced cell adhesion pre-incubated fo...
In DepthDetails ArticlePubMed