BDBM50506019 CHEMBL4473347
SMILES CCC[C@@H](NC(=O)c1ccc(c(c1)C(O)=O)-c1c(Cl)cccc1-c1nc2cc(OC)ccc2[nH]1)c1ccccc1
InChI Key InChIKey=VXGFXZQNRXSRRQ-AREMUKBSSA-N
Data  2 EC50
  Tab Delimited (TSV)   2D SDfile   Computed 3D by Vconf -m prep SDfile
Find this compound or compounds like it in BindingDB:
Activity Spreadsheet -- Enzyme Inhibition Constant Data from BindingDB
Found 2 hits for monomerid = 50506019
TargetApelin receptor(Homo sapiens (Human))
Bristol-Myers Squibb
Curated by ChEMBL
LigandPNGBDBM50506019(CHEMBL4473347)
Affinity DataEC50:  0.0620nM. Assay description: Agonist activity at human APJ-R expressed in HEK293 cells assessed as inhibition of forskolin- stimulated cAMP accumulation incubated for 30 mins by ...
Ligand InfoPC cidPC sid
In DepthDetails ArticlePubMed
TargetApelin receptor(Rattus norvegicus)
Bristol-Myers Squibb
Curated by ChEMBL
LigandPNGBDBM50506019(CHEMBL4473347)
Affinity DataEC50:  0.120nM. Assay description: Agonist activity at rat APJ-R expressed in HEK293 cells assessed as inhibition of forskolin- stimulated cAMP accumulation incubated for 30 mins by HT...
Ligand InfoPC cidPC sid
In DepthDetails ArticlePubMed