BDBM50507476 CHEMBL4555514
SMILES CC(=O)N[C@@H]1[C@@H](O)[C@H](O)[C@@H](CO)O[C@H]1SCCCNCCCN1C(=O)c2cccc3c(Br)ccc(C1=O)c23
InChI Key InChIKey=BQYMYLJRRZPGGF-ILRYNQFESA-N
Data  2 KI
  Tab Delimited (TSV)   2D SDfile   Computed 3D by Vconf -m prep SDfile
Find this compound or compounds like it in BindingDB:
Activity Spreadsheet -- Enzyme Inhibition Constant Data from BindingDB
Found 2 hits for monomerid = 50507476
TargetProtein O-GlcNAcase(Homo sapiens (Human))
China Agricultural University
Curated by ChEMBL
LigandPNGBDBM50507476(CHEMBL4555514)
Affinity DataKi:  2.20E+3nM. Assay description: Inhibition of recombinant human OGA expressed in Escherichia coli BL21 (DE3) using varying levels of 4-Mu-GlcNAc as substrate preincubated for 10 min...
Ligand InfoPC cidPC sid
In DepthDetails ArticlePubMed
TargetBeta-hexosaminidase subunit beta(Homo sapiens (Human))
China Agricultural University
Curated by ChEMBL
LigandPNGBDBM50507476(CHEMBL4555514)
Affinity DataKi:  4.40E+3nM. Assay description: Inhibition of recombinant human His6-tagged HexB expressed in Pichia pastoris using varying levels of 4-Mu-GlcNAc as substrate preincubated for 10 mi...
Ligand InfoPC cidPC sid
In DepthDetails ArticlePubMed