BDBM50508540 CHEMBL4470835
SMILES Cn1ccc2ccc(cc12)-c1cc(Nc2cnccc2C(=O)Nc2cncnc2)cc2nccnc12
InChI Key InChIKey=VODZTUQHGMHXRJ-UHFFFAOYSA-N
Data  2 IC50
PDB links: 1 PDB ID matches this monomer.
  Tab Delimited (TSV)   2D SDfile   Computed 3D by Vconf -m prep SDfile
Find this compound or compounds like it in BindingDB:
Activity Spreadsheet -- Enzyme Inhibition Constant Data from BindingDB
Found 2 hits for monomerid = 50508540
Target6-phosphofructo-2-kinase/fructose-2,6-bisphosphatase 3(Homo sapiens (Human))
Selvita
Curated by ChEMBL
LigandPNGBDBM50508540(CHEMBL4470835)
Affinity DataIC50:  22nM. Assay description: Inhibition of recombinant human His-tagged PFKFB3 expressed in Escherichia coli using fructose-6-phosphate as substrate measured after 2 hrs by ADP-G...
Ligand InfoPC cidPC sidPDB
Target6-phosphofructo-2-kinase/fructose-2,6-bisphosphatase 3(Homo sapiens (Human))
Selvita
Curated by ChEMBL
LigandPNGBDBM50508540(CHEMBL4470835)
Affinity DataIC50:  3.50E+3nM. Assay description: Inhibition of PFKFB3 in human HCT116 cell lysates assessed as reduction in glycolytic-flux induced fructose-2,6-bisphosphate formation using fructose...
Ligand InfoPC cidPC sidPDB