BDBM50509802 CHEMBL4515157
SMILES OC(=O)CC[C@H](NC(=O)[C@H](CC(O)=O)NC(=O)[C@H](Cc1ccc2ccccc2c1)NC(=O)c1cc2cc(Cl)ccc2[nH]1)C(=O)Nc1cccc(c1)C(F)(F)F
InChI Key InChIKey=FQNRPJFGWVMTSM-QMOZSOIISA-N
Data  1 KI  1 IC50
  Tab Delimited (TSV)   2D SDfile   Computed 3D by Vconf -m prep SDfile
Find this compound or compounds like it in BindingDB:
Activity Spreadsheet -- Enzyme Inhibition Constant Data from BindingDB
Found 2 hits for monomerid = 50509802
TargetCatenin beta-1(Homo sapiens (Human))
H. Lee Moffitt Cancer Center And Research Institute
Curated by ChEMBL
LigandPNGBDBM50509802(CHEMBL4515157)
Affinity DataKi:  2.30E+3nM. Assay description: Inhibition of C-terminal fluorescein-labeled human TCF4 (7 to 51 residues) binding to wild-type C-terminal His6-tagged beta-catenin (138 to 781 resid...
Ligand InfoPC cidPC sid
In DepthDetails ArticlePubMed
TargetCatenin beta-1(Homo sapiens (Human))
H. Lee Moffitt Cancer Center And Research Institute
Curated by ChEMBL
LigandPNGBDBM50509802(CHEMBL4515157)
Affinity DataIC50:  8.90E+3nM. Assay description: Inhibition of C-terminal fluorescein-labeled human TCF4 (7 to 51 residues) binding to wild-type C-terminal His6-tagged beta-catenin (138 to 781 resid...
Ligand InfoPC cidPC sid
In DepthDetails ArticlePubMed