BDBM50509833 CHEMBL4464915
SMILES COc1cc(NC(=O)[C@H](CCC(O)=O)NC(=O)[C@H](CC(O)=O)NC(=O)[C@H](Cc2ccc3ccccc3c2)NC(=O)c2cc3cc(Cl)ccc3[nH]2)cc(OC)c1
InChI Key InChIKey=QJCYFTPHOCCBEH-PHDGFQFKSA-N
Data  1 KI  1 IC50
  Tab Delimited (TSV)   2D SDfile   Computed 3D by Vconf -m prep SDfile
Find this compound or compounds like it in BindingDB:
Activity Spreadsheet -- Enzyme Inhibition Constant Data from BindingDB
Found 2 hits for monomerid = 50509833
TargetCatenin beta-1(Homo sapiens (Human))
H. Lee Moffitt Cancer Center And Research Institute
Curated by ChEMBL
LigandPNGBDBM50509833(CHEMBL4464915)
Affinity DataKi:  3.30E+3nM. Assay description: Inhibition of C-terminal fluorescein-labeled human TCF4 (7 to 51 residues) binding to wild-type C-terminal His6-tagged beta-catenin (138 to 781 resid...
Ligand InfoPC cidPC sid
In DepthDetails ArticlePubMed
TargetCatenin beta-1(Homo sapiens (Human))
H. Lee Moffitt Cancer Center And Research Institute
Curated by ChEMBL
LigandPNGBDBM50509833(CHEMBL4464915)
Affinity DataIC50:  1.30E+4nM. Assay description: Inhibition of C-terminal fluorescein-labeled human TCF4 (7 to 51 residues) binding to wild-type C-terminal His6-tagged beta-catenin (138 to 781 resid...
Ligand InfoPC cidPC sid
In DepthDetails ArticlePubMed