BDBM50512794 CHEMBL4450777
SMILES Clc1ccccc1N1CCN(CCCCNC(=O)c2ccc(cc2)-c2ccsc2)CC1
InChI Key InChIKey=KQHFMARZJJGTTG-UHFFFAOYSA-N
Data  2 KI
  Tab Delimited (TSV)   2D SDfile   Computed 3D by Vconf -m prep SDfile
Find this compound or compounds like it in BindingDB:
Activity Spreadsheet -- Enzyme Inhibition Constant Data from BindingDB
Found 2 hits for monomerid = 50512794
TargetD(3) dopamine receptor(Homo sapiens (Human))
Temple University School Of Pharmacy
Curated by ChEMBL
LigandPNGBDBM50512794(CHEMBL4450777)
Affinity DataKi:  0.550nM. Assay description: Displacement of 2,3-dimethoxy-5-[125I]-iodo-N-[9-benzyl-9-azabicyclo[3.3.1]nonan-3beta-yl]benzamide from human dopamine D3 receptor expressed in HEK2...
Ligand InfoPC cidPC sid
In DepthDetails ArticlePubMed
TargetD(2) dopamine receptor(Homo sapiens (Human))
Temple University School Of Pharmacy
Curated by ChEMBL
LigandPNGBDBM50512794(CHEMBL4450777)
Affinity DataKi:  169nM. Assay description: Displacement of 2,3-dimethoxy-5-[125I]-iodo-N-[9-benzyl-9-azabicyclo[3.3.1]nonan-3beta-yl]benzamide from human dopamine D2L receptor expressed in HEK...
Ligand InfoPC cidPC sid
In DepthDetails ArticlePubMed