BDBM50513095 CHEMBL4532583
SMILES CCCCC(C(=O)Nc1ccc(Br)cc1)n1nc(C)cc(Cc2cccc(OC)c2OC)c1=O
InChI Key InChIKey=ANFAKSLECUHRIW-UHFFFAOYSA-N
Data  2 EC50
  Tab Delimited (TSV)   2D SDfile   Computed 3D by Vconf -m prep SDfile
Find this compound or compounds like it in BindingDB:
Activity Spreadsheet -- Enzyme Inhibition Constant Data from BindingDB
Found 2 hits for monomerid = 50513095
TargetfMet-Leu-Phe receptor(Homo sapiens (Human))
Monash University
Curated by ChEMBL
LigandPNGBDBM50513095(CHEMBL4532583)
Affinity DataEC50:  6.5nM. Assay description: Biased agonist activity at human FPR1 expressed in FlpIn-CHO cells assessed as intracellular calcium mobilization by Fluo-4-AM dye based fluorescence...
Ligand InfoPC cidPC sid
In DepthDetails ArticlePubMed
TargetfMet-Leu-Phe receptor(Homo sapiens (Human))
Monash University
Curated by ChEMBL
LigandPNGBDBM50513095(CHEMBL4532583)
Affinity DataEC50:  245nM. Assay description: Biased agonist activity at human FPR1 expressed in FlpIn-CHO cells assessed as stimulation of ERK1/2 phosphorylation measured after 7 mins by Alphasc...
Ligand InfoPC cidPC sid
In DepthDetails ArticlePubMed