BDBM50515764 CHEMBL4533303
SMILES Cc1nnc2CCC(Nc3ccc(Cl)cc3)c3cc(ccc3-n12)-c1cn[nH]c1
InChI Key InChIKey=UFFMFBORABJCTA-UHFFFAOYSA-N
Data  6 KI
  Tab Delimited (TSV)   2D SDfile   Computed 3D by Vconf -m prep SDfile
Find this compound or compounds like it in BindingDB:
Activity Spreadsheet -- Enzyme Inhibition Constant Data from BindingDB
Found 6 hits for monomerid = 50515764
TargetBromodomain-containing protein 3(Homo sapiens (Human))
University Of Chinese Academy Of Sciences
Curated by ChEMBL
LigandPNGBDBM50515764(CHEMBL4533303)
Affinity DataKi:  14nM. Assay description: Binding affinity to human recombinant BRD3 BD2 (306 to 417 residues) by fluorescence polarization assay
Ligand InfoPC cidPC sid
In DepthDetails ArticlePubMed
TargetBromodomain-containing protein 4(Homo sapiens (Human))
University Of Chinese Academy Of Sciences
Curated by ChEMBL
LigandPNGBDBM50515764(CHEMBL4533303)
Affinity DataKi:  16nM. Assay description: Binding affinity to human recombinant BRD4 BD2 (333 to 460 residues) by fluorescence polarization assay
Ligand InfoPC cidPC sid
In DepthDetails ArticlePubMed
TargetBromodomain-containing protein 2(Homo sapiens (Human))
University Of Chinese Academy Of Sciences
Curated by ChEMBL
LigandPNGBDBM50515764(CHEMBL4533303)
Affinity DataKi:  19nM. Assay description: Binding affinity to human recombinant BRD2 BD2 (349 to 460 residues) by fluorescence polarization assay
Ligand InfoPC cidPC sid
In DepthDetails ArticlePubMed
TargetBromodomain-containing protein 3(Homo sapiens (Human))
University Of Chinese Academy Of Sciences
Curated by ChEMBL
LigandPNGBDBM50515764(CHEMBL4533303)
Affinity DataKi:  114nM. Assay description: Binding affinity to human recombinant BRD3 BD1 (24 to 144 residues) by fluorescence polarization assay
Ligand InfoPC cidPC sid
In DepthDetails ArticlePubMed
TargetBromodomain-containing protein 4(Homo sapiens (Human))
University Of Chinese Academy Of Sciences
Curated by ChEMBL
LigandPNGBDBM50515764(CHEMBL4533303)
Affinity DataKi:  126nM. Assay description: Binding affinity to human recombinant BRD4 BD1 (44 to 168 residues) by fluorescence polarization assay
Ligand InfoPC cidPC sid
In DepthDetails ArticlePubMed
TargetBromodomain-containing protein 2(Homo sapiens (Human))
University Of Chinese Academy Of Sciences
Curated by ChEMBL
LigandPNGBDBM50515764(CHEMBL4533303)
Affinity DataKi:  270nM. Assay description: Binding affinity to human recombinant BRD2 BD1 (72 to 205 residues) by fluorescence polarization assay
Ligand InfoPC cidPC sid
In DepthDetails ArticlePubMed