BDBM50516416 CHEMBL4541860
SMILES [H][C@@]12C[C@@]1(CN(C2)c1nnc(C(F)F)n1-c1ccc(OC)nc1)c1ccc(F)cc1Cl
InChI Key InChIKey=XQFHGMGKZMZFTF-YBTHPKLGSA-N
Data  2 IC50
  Tab Delimited (TSV)   2D SDfile   Computed 3D by Vconf -m prep SDfile
Find this compound or compounds like it in BindingDB:
Activity Spreadsheet -- Enzyme Inhibition Constant Data from BindingDB
Found 2 hits for monomerid = 50516416
TargetVasopressin V1a receptor(Homo sapiens (Human))
Shanghai Hengrui Pharmaceutical
Curated by ChEMBL
LigandPNGBDBM50516416(CHEMBL4541860)
Affinity DataIC50:  1.87E+3nM. Assay description: Antagonist activity at human vasopressin V1A receptor expressed in HEK293 cells assessed as decrease in vasopressin-stimulated calcium flux measured ...
Ligand InfoPC cidPC sid
In DepthDetails ArticlePubMed
TargetOxytocin receptor(Homo sapiens (Human))
Shanghai Hengrui Pharmaceutical
Curated by ChEMBL
LigandPNGBDBM50516416(CHEMBL4541860)
Affinity DataIC50:  52nM. Assay description: Antagonist activity at human OTR expressed in HEK293 cells assessed as decrease in calcium flux measured after 10 mins in presence of vasopressin by ...
Ligand InfoPC cidPC sid
In DepthDetails ArticlePubMed