BDBM50517607 CHEMBL4590398
SMILES CC(C)C[C@H](NC(=O)[C@H](Cc1ccccc1)N=[N+]=[N-])C(=O)N[C@@H]([C@@H](C)O)C(=O)N[C@@H](Cc1ccc(CN)cc1)\C=C\S(C)(=O)=O
InChI Key InChIKey=OSCQGDIKEUNOAP-XNQSZOFZSA-N
Data  14 IC50
  Tab Delimited (TSV)   2D SDfile   Computed 3D by Vconf -m prep SDfile
Find this compound or compounds like it in BindingDB:
Activity Spreadsheet -- Enzyme Inhibition Constant Data from BindingDB
Found 14 hits for monomerid = 50517607
TargetProteasome subunit beta type-10(Homo sapiens (Human))
Leiden Institute Of Chemistry And Netherlands Proteomics Centre
Curated by ChEMBL
LigandPNGBDBM50517607(CHEMBL4590398)
Affinity DataIC50:  110nM. Assay description: Inhibition of 20S immunoproteasome beta 2 in human Raji cell lysates after 1 hr by competitive ABPP assay
Ligand InfoPC cidPC sid
In DepthDetails ArticlePubMed
TargetProteasome subunit beta type-10(Homo sapiens (Human))
Leiden Institute Of Chemistry And Netherlands Proteomics Centre
Curated by ChEMBL
LigandPNGBDBM50517607(CHEMBL4590398)
Affinity DataIC50: >1.00E+4nM. Assay description: Inhibition of 20S immunoproteasome beta 2 in human RPMI8226 cell lysates after 1 hr by coomassie brilliant blue staining-based fluorescence assay
Ligand InfoPC cidPC sid
In DepthDetails ArticlePubMed
TargetProteasome subunit beta type-10(Homo sapiens (Human))
Leiden Institute Of Chemistry And Netherlands Proteomics Centre
Curated by ChEMBL
LigandPNGBDBM50517607(CHEMBL4590398)
Affinity DataIC50:  330nM. Assay description: Inhibition of 20S immunoproteasome beta 2 (unknown origin) by cell based ABPP assay
Ligand InfoPC cidPC sid
In DepthDetails ArticlePubMed
TargetProteasome subunit beta type-2(Homo sapiens (Human))
Leiden Institute Of Chemistry And Netherlands Proteomics Centre
Curated by ChEMBL
LigandPNGBDBM50517607(CHEMBL4590398)
Affinity DataIC50:  7nM. Assay description: Inhibition of 20S constitutive proteasome beta 2 trypsin-like activity in human Raji cell lysates after 1 hr by competitive ABPP assay
Ligand InfoPC cidPC sid
In DepthDetails ArticlePubMed
TargetProteasome subunit beta type-5(Homo sapiens (Human))
Leiden Institute Of Chemistry And Netherlands Proteomics Centre
Curated by ChEMBL
LigandPNGBDBM50517607(CHEMBL4590398)
Affinity DataIC50: >1.00E+4nM. Assay description: Inhibition of 20S constitutive proteasome beta 5 chymotrypsin-like activity in human RPMI8226 cell lysates after 1 hr by coomassie brilliant blue sta...
Ligand InfoPC cidPC sid
In DepthDetails ArticlePubMed
TargetProteasome subunit beta type-1(Homo sapiens (Human))
Leiden Institute Of Chemistry And Netherlands Proteomics Centre
Curated by ChEMBL
LigandPNGBDBM50517607(CHEMBL4590398)
Affinity DataIC50: >1.00E+4nM. Assay description: Inhibition of 20S constitutive proteasome beta 1 caspase-like activity in human RPMI8226 cell lysates after 1 hr by coomassie brilliant blue staining...
Ligand InfoPC cidPC sid
In DepthDetails ArticlePubMed
TargetProteasome subunit beta type-1(Homo sapiens (Human))
Leiden Institute Of Chemistry And Netherlands Proteomics Centre
Curated by ChEMBL
LigandPNGBDBM50517607(CHEMBL4590398)
Affinity DataIC50: >1.00E+5nM. Assay description: Inhibition of 20S constitutive proteasome beta 1 caspase-like activity in human Raji cell lysates after 1 hr by competitive ABPP assay
Ligand InfoPC cidPC sid
In DepthDetails ArticlePubMed
TargetProteasome subunit beta type-9(Homo sapiens (Human))
Leiden Institute Of Chemistry And Netherlands Proteomics Centre
Curated by ChEMBL
LigandPNGBDBM50517607(CHEMBL4590398)
Affinity DataIC50: >1.00E+5nM. Assay description: Inhibition of 20S immunoproteasome beta 1 in human Raji cell lysates after 1 hr by competitive ABPP assay
Ligand InfoPC cidPC sid
In DepthDetails ArticlePubMed
TargetProteasome subunit beta type-2(Homo sapiens (Human))
Leiden Institute Of Chemistry And Netherlands Proteomics Centre
Curated by ChEMBL
LigandPNGBDBM50517607(CHEMBL4590398)
Affinity DataIC50:  1.25E+3nM. Assay description: Inhibition of 20S constitutive proteasome beta 2 trypsin-like activity in human RPMI8226 cell lysates after 1 hr by coomassie brilliant blue staining...
Ligand InfoPC cidPC sid
In DepthDetails ArticlePubMed
TargetProteasome subunit beta type-2(Homo sapiens (Human))
Leiden Institute Of Chemistry And Netherlands Proteomics Centre
Curated by ChEMBL
LigandPNGBDBM50517607(CHEMBL4590398)
Affinity DataIC50:  8nM. Assay description: Inhibition of 20S constitutive proteasome beta 2 trypsin-like activity (unknown origin) by cell based ABPP assay
Ligand InfoPC cidPC sid
In DepthDetails ArticlePubMed
TargetProteasome subunit beta type-5(Homo sapiens (Human))
Leiden Institute Of Chemistry And Netherlands Proteomics Centre
Curated by ChEMBL
LigandPNGBDBM50517607(CHEMBL4590398)
Affinity DataIC50:  750nM. Assay description: Inhibition of 20S constitutive proteasome beta 5 chymotrypsin-like activity in human Raji cell lysates after 1 hr by competitive ABPP assay
Ligand InfoPC cidPC sid
In DepthDetails ArticlePubMed
TargetProteasome subunit beta type-8(Homo sapiens (Human))
Leiden Institute Of Chemistry And Netherlands Proteomics Centre
Curated by ChEMBL
LigandPNGBDBM50517607(CHEMBL4590398)
Affinity DataIC50:  2.10E+3nM. Assay description: Inhibition of 20S immunoproteasome beta 5 in human Raji cell lysates after 1 hr by competitive ABPP assay
Ligand InfoPC cidPC sid
In DepthDetails ArticlePubMed
TargetProteasome subunit beta type-8(Homo sapiens (Human))
Leiden Institute Of Chemistry And Netherlands Proteomics Centre
Curated by ChEMBL
LigandPNGBDBM50517607(CHEMBL4590398)
Affinity DataIC50: >1.00E+4nM. Assay description: Inhibition of 20S immunoproteasome beta 5 in human RPMI8226 cell lysates after 1 hr by coomassie brilliant blue staining-based fluorescence assay
Ligand InfoPC cidPC sid
In DepthDetails ArticlePubMed
TargetProteasome subunit beta type-9(Homo sapiens (Human))
Leiden Institute Of Chemistry And Netherlands Proteomics Centre
Curated by ChEMBL
LigandPNGBDBM50517607(CHEMBL4590398)
Affinity DataIC50: >1.00E+4nM. Assay description: Inhibition of 20S immunoproteasome beta 1 in human RPMI8226 cell lysates after 1 hr by coomassie brilliant blue staining-based fluorescence assay
Ligand InfoPC cidPC sid
In DepthDetails ArticlePubMed