BDBM50518516 CHEMBL4445116
SMILES CC(C)(CC#Cc1c(Cl)c2c(Cl)cc(nc2n1[C@H]1CCCNC1)C(N)=O)C#N
InChI Key InChIKey=UDHXHJAZPMOTOA-LBPRGKRZSA-N
Data  3 IC50  1 EC50
  Tab Delimited (TSV)   2D SDfile   Computed 3D by Vconf -m prep SDfile
Find this compound or compounds like it in BindingDB:
Activity Spreadsheet -- Enzyme Inhibition Constant Data from BindingDB
Found 4 hits for monomerid = 50518516
TargetSerine/threonine-protein kinase pim-1/pim-2/pim-3(Homo sapiens (Human))
Sanofi
Curated by ChEMBL
LigandPNGBDBM50518516(CHEMBL4445116)
Affinity DataEC50:  90nM. Assay description: Inhibition of PIM in human KG1 cells assessed as reduction in pS6 level
Ligand InfoPC cidPC sid
In DepthDetails ArticlePubMed
TargetSerine/threonine-protein kinase pim-1(Homo sapiens (Human))
Sanofi
Curated by ChEMBL
LigandPNGBDBM50518516(CHEMBL4445116)
Affinity DataIC50:  5.80nM. Assay description: Inhibition of PIM1 (unknown origin) assessed as reduction in BAD phosphorylation at Ser-112 residue by TR-FRET assay
Ligand InfoPC cidPC sid
In DepthDetails ArticlePubMed
TargetSerine/threonine-protein kinase pim-2(Homo sapiens (Human))
Sanofi
Curated by ChEMBL
LigandPNGBDBM50518516(CHEMBL4445116)
Affinity DataIC50:  29nM. Assay description: Inhibition of PIM2 (unknown origin) assessed as reduction in BAD phosphorylation at Ser-112 residue by TR-FRET assay
Ligand InfoPC cidPC sid
In DepthDetails ArticlePubMed
TargetPotassium voltage-gated channel subfamily H member 2(Homo sapiens (Human))
Sanofi
Curated by ChEMBL
LigandPNGBDBM50518516(CHEMBL4445116)
Affinity DataIC50:  3nM. Assay description: Inhibition of human ERG
Ligand InfoPC cidPC sid
In DepthDetails ArticlePubMed