BDBM50520058 CHEMBL4469390
SMILES CC[C@H](C)[C@@H]1NC(=O)[C@@H]2CCCN2C(=O)[C@@H]2CCCN2C(=O)[C@H](Cc2ccc(cc2)-c2ccccc2)NC(=O)[C@H](CO)NC(=O)[C@H](Cc2ccc(O)cc2)NC(=O)[C@H](C)NC(=O)[C@@H]2CSSC[C@H](NC1=O)C(=O)N[C@@H](Cc1ccccc1)C(=O)N1CCC[C@H]1C(=O)N[C@@H](CC(O)=O)C(=O)NCC(=O)N[C@@H](Cc1ccccc1)C(=O)N2
InChI Key InChIKey=ZBVDAILDYSBUAI-IPGQWSIKSA-N
Data  3 KI
  Tab Delimited (TSV)   2D SDfile   Computed 3D by Vconf -m prep SDfile
Find this compound or compounds like it in BindingDB:
Activity Spreadsheet -- Enzyme Inhibition Constant Data from BindingDB
Found 3 hits for monomerid = 50520058
TargetChymotrypsinogen B2(Homo sapiens)
The University Of Queensland
Curated by ChEMBL
LigandPNGBDBM50520058(CHEMBL4469390)
Affinity DataKi:  1.5nM. Assay description: Inhibition of human chymotrypsin using Suc-AAPF-MCA as substrate at pH 8 and 298 K measured every 60 secs for 600 secs
Ligand InfoPC cidPC sid
In DepthDetails ArticlePubMed
TargetCathepsin G(Homo sapiens (Human))
The University Of Queensland
Curated by ChEMBL
LigandPNGBDBM50520058(CHEMBL4469390)
Affinity DataKi:  7.40nM. Assay description: Inhibition of human cathepsin G using Suc-AAPF-MCA as substrate at pH 7.2 and 298 K measured every 60 secs for 600 secs
Ligand InfoPC cidPC sid
In DepthDetails ArticlePubMed
TargetChymase(Homo sapiens (Human))
The University Of Queensland
Curated by ChEMBL
LigandPNGBDBM50520058(CHEMBL4469390)
Affinity DataKi:  20nM. Assay description: Inhibition of recombinant human chymase expressed in Pichia pastoris X-33 cells using NleTDY-pNA as substrate assessed as cleavage of pNA at pH 7.2 a...
Ligand InfoPC cidPC sid
In DepthDetails ArticlePubMed