BDBM50520712 CHEMBL4556242
SMILES OCCCC#Cc1cncc(OCC2(Cc3cccc(Cl)c3)CCCNC2)c1
InChI Key InChIKey=SDTCAZIAOUGNFP-UHFFFAOYSA-N
Data  1 KI
  Tab Delimited (TSV)   2D SDfile   Computed 3D by Vconf -m prep SDfile
Find this compound or compounds like it in BindingDB:
Activity Spreadsheet -- Enzyme Inhibition Constant Data from BindingDB
Found 1 hit for monomerid = 50520712
TargetAcetylcholine-binding protein(Lymnaea stagnalis)
Fudan University
Curated by ChEMBL
LigandPNGBDBM50520712(CHEMBL4556242)
Affinity DataKi:  12nM. Assay description: Displacement of [3H]epibatidine from Lymnaea stagnalis acetylcholine-binding protein incubated for 60 mins followed by 3 hrs incubation in dark condi...
Ligand InfoPC cidPC sid
In DepthDetails ArticlePubMed