BDBM50520723 CHEMBL4440256
SMILES Clc1ccc(CC2(COc3cccnc3)CCCNC2)cc1Cl
InChI Key InChIKey=GDWGKXWHTRSAQZ-UHFFFAOYSA-N
Data  1 KI
  Tab Delimited (TSV)   2D SDfile   Computed 3D by Vconf -m prep SDfile
Find this compound or compounds like it in BindingDB:
Activity Spreadsheet -- Enzyme Inhibition Constant Data from BindingDB
Found 1 hit for monomerid = 50520723
TargetAcetylcholine-binding protein(Lymnaea stagnalis)
Fudan University
Curated by ChEMBL
LigandPNGBDBM50520723(CHEMBL4440256)
Affinity DataKi:  2.30nM. Assay description: Displacement of [3H]epibatidine from Lymnaea stagnalis acetylcholine-binding protein incubated for 60 mins followed by 3 hrs incubation in dark condi...
Ligand InfoPC cidPC sid
In DepthDetails ArticlePubMed