BDBM50521102 CHEMBL4582554
SMILES Cc1ccc(cc1C(F)(F)F)C(=O)Nc1nnc(o1)-c1ccc2CCCCc2c1
InChI Key InChIKey=UYXQGEFSHLNDGZ-UHFFFAOYSA-N
Data  2 IC50
  Tab Delimited (TSV)   2D SDfile   Computed 3D by Vconf -m prep SDfile
Find this compound or compounds like it in BindingDB:
Activity Spreadsheet -- Enzyme Inhibition Constant Data from BindingDB
Found 2 hits for monomerid = 50521102
TargetAdenylate cyclase type 1(Homo sapiens (Human))
Purdue University
Curated by ChEMBL
LigandPNGBDBM50521102(CHEMBL4582554)
Affinity DataIC50:  2.60E+4nM. Assay description: Inhibition of human AC1 expressed in HEK293 cells assessed as decrease in A23187-stimulated cAMP accumulation preincubated for 30 mins followed by A2...
Ligand InfoPC cidPC sid
In DepthDetails ArticlePubMed
TargetAdenylate cyclase type 8(Homo sapiens (Human))
Purdue University
Curated by ChEMBL
LigandPNGBDBM50521102(CHEMBL4582554)
Affinity DataIC50:  1.30E+4nM. Assay description: Inhibition of human AC8 expressed in HEK293 cells assessed as decrease in A23187-stimulated cAMP accumulation preincubated for 30 mins followed by A2...
Ligand InfoPC cidPC sid
In DepthDetails ArticlePubMed