BDBM50521287 CHEMBL4448132
SMILES CCOC(=O)Nc1ccc(cc1NC(=O)OCC)N(CC#C)Cc1ccc(F)cc1
InChI Key InChIKey=IXCVFHVYOARRRS-UHFFFAOYSA-N
Data  1 EC50
  Tab Delimited (TSV)   2D SDfile   Computed 3D by Vconf -m prep SDfile
Find this compound or compounds like it in BindingDB:
Activity Spreadsheet -- Enzyme Inhibition Constant Data from BindingDB
Found 1 hit for monomerid = 50521287
TargetPotassium voltage-gated channel subfamily KQT member 4(Homo sapiens (Human))
Chinese Academy Of Sciences
Curated by ChEMBL
LigandPNGBDBM50521287(CHEMBL4448132)
Affinity DataEC50:  890nM. Assay description: Activation of human homomeric KCNQ4 expressed in CHOK1 cells at -10 mV by whole cell patch clamp assay
Ligand InfoPC cidPC sid
In DepthDetails ArticlePubMed