BDBM50521761 CHEMBL4446894
SMILES Cc1c(Cl)c2nncn2c2sc(C(=O)NC3CC3)c(N)c12
InChI Key InChIKey=GJBTVOXIYOZSSI-UHFFFAOYSA-N
Data  1 EC50
  Tab Delimited (TSV)   2D SDfile   Computed 3D by Vconf -m prep SDfile
Find this compound or compounds like it in BindingDB:
Activity Spreadsheet -- Enzyme Inhibition Constant Data from BindingDB
Found 1 hit for monomerid = 50521761
TargetMuscarinic acetylcholine receptor M4(Homo sapiens (Human))
Vanderbilt University
Curated by ChEMBL
LigandPNGBDBM50521761(CHEMBL4446894)
Affinity DataEC50:  16nM. Assay description: Positive allosteric modulation of human M4 AchR expressed in CHO cells co-expressing Gqi5 assessed as increase in acetylcholine-induced calcium mobil...
Ligand InfoPC cidPC sid
In DepthDetails ArticlePubMed