BDBM50523350 CHEMBL4434778
SMILES NS(=O)(=O)c1ccc(cc1)-n1nc(ccc1=O)-c1ccccc1O
InChI Key InChIKey=JUUOOIOGZQNKAU-UHFFFAOYSA-N
Data  4 KI
  Tab Delimited (TSV)   2D SDfile   Computed 3D by Vconf -m prep SDfile
Find this compound or compounds like it in BindingDB:
Activity Spreadsheet -- Enzyme Inhibition Constant Data from BindingDB
Found 4 hits for monomerid = 50523350
TargetCarbonic anhydrase 9(Homo sapiens (Human))
Saint Petersburg State University
Curated by ChEMBL
LigandPNGBDBM50523350(CHEMBL4434778)
Affinity DataKi:  0.460nM. Assay description: Inhibition of membrane bound human CA 9 preincubated for 15 mins by phenol red dye-based stopped-flow CO2 hydration assay
Ligand InfoPC cidPC sid
In DepthDetails ArticlePubMed
TargetCarbonic anhydrase 2(Homo sapiens (Human))
Saint Petersburg State University
Curated by ChEMBL
LigandPNGBDBM50523350(CHEMBL4434778)
Affinity DataKi:  0.620nM. Assay description: Inhibition of human cytosolic CA 2 preincubated for 15 mins by phenol red dye-based stopped-flow CO2 hydration assay
Ligand InfoPC cidPC sid
In DepthDetails ArticlePubMed
TargetCarbonic anhydrase 12(Homo sapiens (Human))
Saint Petersburg State University
Curated by ChEMBL
LigandPNGBDBM50523350(CHEMBL4434778)
Affinity DataKi:  9.30nM. Assay description: Inhibition of membrane bound human CA 12 preincubated for 15 mins by phenol red dye-based stopped-flow CO2 hydration assay
Ligand InfoPC cidPC sid
In DepthDetails ArticlePubMed
TargetCarbonic anhydrase 1(Homo sapiens (Human))
Saint Petersburg State University
Curated by ChEMBL
LigandPNGBDBM50523350(CHEMBL4434778)
Affinity DataKi:  84nM. Assay description: Inhibition of human cytosolic CA 1 preincubated for 15 mins by phenol red dye-based stopped-flow CO2 hydration assay
Ligand InfoPC cidPC sid
In DepthDetails ArticlePubMed