BDBM50524701 CHEMBL4594074
SMILES CC(N1CCOCC1)c1cc(OC(=O)N2CCOCC2)c2ncccc2c1
InChI Key InChIKey=CZTROFGRSNHPQM-UHFFFAOYSA-N
Data  1 IC50
  Tab Delimited (TSV)   2D SDfile   Computed 3D by Vconf -m prep SDfile
Find this compound or compounds like it in BindingDB:
Activity Spreadsheet -- Enzyme Inhibition Constant Data from BindingDB
Found 1 hit for monomerid = 50524701
TargetAcetylcholine receptor subunit epsilon(Rattus norvegicus)
Zhejiang Academy Of Medical Sciences
Curated by ChEMBL
LigandPNGBDBM50524701(CHEMBL4594074)
Affinity DataIC50:  8.30E+3nM. Assay description: Inhibition of rat brain cortex AChE using acetylthiocholine iodide as substrate incubated for 15 mins by spectrophotometry
Ligand InfoPC cidPC sid
In DepthDetails ArticlePubMed