BDBM50525596 CHEMBL4590477
SMILES Cc1cc(cc(c1)C1(CN)CCC1)-c1ccnc2[nH]nc(c12)C(F)(F)F
InChI Key InChIKey=FDCMEPRGSNNHNX-UHFFFAOYSA-N
Data  3 KI  1 IC50
  Tab Delimited (TSV)   2D SDfile   Computed 3D by Vconf -m prep SDfile
Find this compound or compounds like it in BindingDB:
Activity Spreadsheet -- Enzyme Inhibition Constant Data from BindingDB
Found 4 hits for monomerid = 50525596
TargetProtein kinase C theta type(Homo sapiens (Human))
Vertex Pharmaceuticals
Curated by ChEMBL
LigandPNGBDBM50525596(CHEMBL4590477)
Affinity DataKi:  3nM. Assay description: Inhibition of human recombinant full length His tagged PKC theta expressed in baculovirus using ERMRPRKRQGSVRRRV peptide as substrate incubated for 6...
Ligand InfoPC cidPC sid
In DepthDetails ArticlePubMed
TargetProtein kinase C alpha type(Homo sapiens (Human))
Vertex Pharmaceuticals
Curated by ChEMBL
LigandPNGBDBM50525596(CHEMBL4590477)
Affinity DataKi:  60nM. Assay description: Inhibition of recombinant full length PKC alpha (unknown origin) using RRRRRKGSFKRKA peptide as substrate measured after 15 mins in presence of ATP b...
Ligand InfoPC cidPC sid
In DepthDetails ArticlePubMed
TargetProtein kinase C delta type(Homo sapiens (Human))
Vertex Pharmaceuticals
Curated by ChEMBL
LigandPNGBDBM50525596(CHEMBL4590477)
Affinity DataKi:  135nM. Assay description: Inhibition of recombinant full length PKC delta (unknown origin) using ERMRPRKR- QGSVRRRV peptide as substrate measured after 15 mins in presence of ...
Ligand InfoPC cidPC sid
In DepthDetails ArticlePubMed
TargetPotassium voltage-gated channel subfamily H member 2(Homo sapiens (Human))
Vertex Pharmaceuticals
Curated by ChEMBL
LigandPNGBDBM50525596(CHEMBL4590477)
Affinity DataIC50:  700nM. Assay description: Inhibition of human ERG
Ligand InfoPC cidPC sid
In DepthDetails ArticlePubMed