BDBM50525603 CHEMBL4528271
SMILES CCC(C)(CN)c1cccc(c1)-c1ccnc2[nH]nc(Cl)c12
InChI Key InChIKey=WOYVNPWMXAUALO-UHFFFAOYSA-N
Data  1 KI
  Tab Delimited (TSV)   2D SDfile   Computed 3D by Vconf -m prep SDfile
Find this compound or compounds like it in BindingDB:
Activity Spreadsheet -- Enzyme Inhibition Constant Data from BindingDB
Found 1 hit for monomerid = 50525603
TargetProtein kinase C theta type(Homo sapiens (Human))
Vertex Pharmaceuticals
Curated by ChEMBL
LigandPNGBDBM50525603(CHEMBL4528271)
Affinity DataKi:  0.300nM. Assay description: Inhibition of human recombinant full length His tagged PKC theta expressed in baculovirus using ERMRPRKRQGSVRRRV peptide as substrate incubated for 6...
Ligand InfoPC cidPC sid
In DepthDetails ArticlePubMed