BDBM50525790 CHEMBL4578823
SMILES CC(C)(C)C(=O)Nc1nnc(OC2CCN(CC2)c2nnc(NC(=O)Cc3ccccc3)s2)s1
InChI Key InChIKey=GTQAVMIAQGZYNU-UHFFFAOYSA-N
Data  2 IC50
  Tab Delimited (TSV)   2D SDfile   Computed 3D by Vconf -m prep SDfile
Find this compound or compounds like it in BindingDB:
Activity Spreadsheet -- Enzyme Inhibition Constant Data from BindingDB
Found 2 hits for monomerid = 50525790
TargetGlutaminase kidney isoform, mitochondrial(Homo sapiens (Human))
University Of Pittsburgh
Curated by ChEMBL
LigandPNGBDBM50525790(CHEMBL4578823)
Affinity DataIC50:  38nM. Assay description: Inhibition of recombinant human His-tagged GAC (72 to 603 residues) expressed in Escherichia coli using glutamine as substrate incubated for 10 mins
Ligand InfoPC cidPC sid
In DepthDetails ArticlePubMed
TargetGlutaminase kidney isoform, mitochondrial(Homo sapiens (Human))
University Of Pittsburgh
Curated by ChEMBL
LigandPNGBDBM50525790(CHEMBL4578823)
Affinity DataIC50:  38nM. Assay description: Inhibition of recombinant human His-tagged GAC (72 to 603 residues) expressed in Escherichia coli using glutamine as substrate incubated for 10 mins
Ligand InfoPC cidPC sid
In DepthDetails ArticlePubMed