BDBM50527220 CHEMBL4451170::US10829446, Compound 58
SMILES Fc1ccccc1S(=O)(=O)NNC(=O)c1cccc(c1)-n1cccn1
InChI Key InChIKey=RTAIDSNRSGJQHT-UHFFFAOYSA-N
Data  3 IC50
  Tab Delimited (TSV)   2D SDfile   Computed 3D by Vconf -m prep SDfile
Find this compound or compounds like it in BindingDB:
Activity Spreadsheet -- Enzyme Inhibition Constant Data from BindingDB
Found 3 hits for monomerid = 50527220
TargetHistone acetyltransferase KAT6A [507-778](Homo sapiens)
Monash University (Parkville Campus)
Curated by ChEMBL
LigandPNGBDBM50527220(CHEMBL4451170 | US10829446, Compound 58)
Affinity DataIC50:  43nM. Assay description: Inhibition of N-terminal NusA-fused His6-tagged human KAT6A (507 to 778 residues) expressed in Escherichia coli BL21 (DE3) cells using 0.4 uM acetyl ...
Ligand InfoPC cidPC sid
In DepthDetails ArticlePubMed
TargetHistone acetyltransferase KAT6A [507-778](Homo sapiens)
Monash University (Parkville Campus)
Curated by ChEMBL
LigandPNGBDBM50527220(CHEMBL4451170 | US10829446, Compound 58)
Affinity DataIC50:  123nM. Assay description: Active Moz protein was expressed as N-terminal fusion protein with a His6 tag in BL21 E. coli cells. Protein purification was performed via nickel-im...
Ligand InfoPC cidPC sid
In DepthDetails US Patent
TargetHistone acetyltransferase KAT6A [507-778](Homo sapiens)
Monash University (Parkville Campus)
Curated by ChEMBL
LigandPNGBDBM50527220(CHEMBL4451170 | US10829446, Compound 58)
Affinity DataIC50:  480nM. Assay description: Inhibition of recombinant KAT6A (unknown origin) expressed in C57BL/6 mouse embryonic fibroblasts assessed as reduction in cell proliferation supplem...
Ligand InfoPC cidPC sid
In DepthDetails ArticlePubMed