BDBM50527221 CHEMBL4464911::US10829446, Compound 64
SMILES Fc1cc(cc(c1)-n1cccn1)C(=O)NNS(=O)(=O)c1ccccc1F
InChI Key InChIKey=QWXYCBJVEKGULU-UHFFFAOYSA-N
Data  3 IC50
  Tab Delimited (TSV)   2D SDfile   Computed 3D by Vconf -m prep SDfile
Find this compound or compounds like it in BindingDB:
Activity Spreadsheet -- Enzyme Inhibition Constant Data from BindingDB
Found 3 hits for monomerid = 50527221
TargetHistone acetyltransferase KAT6A [507-778](Homo sapiens)
Monash University (Parkville Campus)
Curated by ChEMBL
LigandPNGBDBM50527221(CHEMBL4464911 | US10829446, Compound 64)
Affinity DataIC50:  990nM. Assay description: Inhibition of recombinant KAT6A (unknown origin) expressed in C57BL/6 mouse embryonic fibroblasts assessed as reduction in cell proliferation supplem...
Ligand InfoPC cidPC sid
In DepthDetails ArticlePubMed
TargetHistone acetyltransferase KAT6A [507-778](Homo sapiens)
Monash University (Parkville Campus)
Curated by ChEMBL
LigandPNGBDBM50527221(CHEMBL4464911 | US10829446, Compound 64)
Affinity DataIC50:  70nM. Assay description: Active Moz protein was expressed as N-terminal fusion protein with a His6 tag in BL21 E. coli cells. Protein purification was performed via nickel-im...
Ligand InfoPC cidPC sid
In DepthDetails US Patent
TargetHistone acetyltransferase KAT6A [507-778](Homo sapiens)
Monash University (Parkville Campus)
Curated by ChEMBL
LigandPNGBDBM50527221(CHEMBL4464911 | US10829446, Compound 64)
Affinity DataIC50:  23nM. Assay description: Inhibition of N-terminal NusA-fused His6-tagged human KAT6A (507 to 778 residues) expressed in Escherichia coli BL21 (DE3) cells using 0.4 uM acetyl ...
Ligand InfoPC cidPC sid
In DepthDetails ArticlePubMed