BDBM50527264 CHEMBL4530056
SMILES CCOCc1cc(C)cc(c1)C(=O)NNS(=O)(=O)c1ccccc1F
InChI Key InChIKey=JRPRFHKTWTUXLH-UHFFFAOYSA-N
Data  1 IC50
  Tab Delimited (TSV)   2D SDfile   Computed 3D by Vconf -m prep SDfile
Find this compound or compounds like it in BindingDB:
Activity Spreadsheet -- Enzyme Inhibition Constant Data from BindingDB
Found 1 hit for monomerid = 50527264
TargetHistone acetyltransferase KAT6A [507-778](Homo sapiens)
Monash University (Parkville Campus)
Curated by ChEMBL
LigandPNGBDBM50527264(CHEMBL4530056)
Affinity DataIC50:  24nM. Assay description: Inhibition of N-terminal NusA-fused His6-tagged human KAT6A (507 to 778 residues) expressed in Escherichia coli BL21 (DE3) cells using 0.4 uM acetyl ...
Ligand InfoPC cidPC sid
In DepthDetails ArticlePubMed