BDBM50527475 CHEMBL4470184
SMILES CC(C)CC1C(C(=O)Nc2ccccc2C)=C(C)NC2=C1C(=O)CCC2
InChI Key InChIKey=WANKUDAVLWNZIU-UHFFFAOYSA-N
Data  3 EC50
  Tab Delimited (TSV)   2D SDfile   Computed 3D by Vconf -m prep SDfile
Find this compound or compounds like it in BindingDB:
Activity Spreadsheet -- Enzyme Inhibition Constant Data from BindingDB
Found 3 hits for monomerid = 50527475
TargetFree fatty acid receptor 3(Homo sapiens (Human))
University Of Copenhagen
Curated by ChEMBL
LigandPNGBDBM50527475(CHEMBL4470184)
Affinity DataEC50:  2.09E+3nM. Assay description: Agonist activity at human FFA3 receptor stably expressed in Flp-In T-Rex HEK293 cell membrane assessed as stimulation of [35S]-GTPgammaS binding meas...
Ligand InfoPC cidPC sid
In DepthDetails ArticlePubMed
TargetFree fatty acid receptor 3(Homo sapiens (Human))
University Of Copenhagen
Curated by ChEMBL
LigandPNGBDBM50527475(CHEMBL4470184)
Affinity DataEC50:  525nM. Assay description: Positive allosteric modulation at human FFA3 receptor stably expressed in Flp-In T-Rex HEK293 cells cotransfected with eYFP assessed as inhibition of...
Ligand InfoPC cidPC sid
In DepthDetails ArticlePubMed
TargetFree fatty acid receptor 3(Homo sapiens (Human))
University Of Copenhagen
Curated by ChEMBL
LigandPNGBDBM50527475(CHEMBL4470184)
Affinity DataEC50:  1.00E+4nM. Assay description: Agonist activity at human FFA3 receptor stably expressed in Flp-In T-Rex HEK293 cells cotransfected with eYFP assessed as inhibition of forskolin-ind...
Ligand InfoPC cidPC sid
In DepthDetails ArticlePubMed