BDBM50527491 CHEMBL4440835
SMILES CCCC1C(C(=O)Nc2cc(C)ccc2Cl)=C(C)NC2=C1C(=O)CCC2
InChI Key InChIKey=FNELRMSVIVZRDB-UHFFFAOYSA-N
Data  1 EC50
  Tab Delimited (TSV)   2D SDfile   Computed 3D by Vconf -m prep SDfile
Find this compound or compounds like it in BindingDB:
Activity Spreadsheet -- Enzyme Inhibition Constant Data from BindingDB
Found 1 hit for monomerid = 50527491
TargetFree fatty acid receptor 3(Homo sapiens (Human))
University Of Copenhagen
Curated by ChEMBL
LigandPNGBDBM50527491(CHEMBL4440835)
Affinity DataEC50:  646nM. Assay description: Agonist activity at human FFA3 receptor stably expressed in Flp-In T-Rex HEK293 cells cotransfected with eYFP assessed as inhibition of forskolin-ind...
Ligand InfoPC cidPC sid
In DepthDetails ArticlePubMed