BDBM50530394 CHEMBL4561663
SMILES NC(=O)c1ccccc1Nc1cc(Nc2ccc(F)cn2)ncc1C(N)=O
InChI Key InChIKey=HZNQENBILSFKNN-UHFFFAOYSA-N
Data  2 KI  16 IC50  2 EC50
  Tab Delimited (TSV)   2D SDfile   Computed 3D by Vconf -m prep SDfile
Find this compound or compounds like it in BindingDB:
Activity Spreadsheet -- Enzyme Inhibition Constant Data from BindingDB
Found 20 hits for monomerid = 50530394
TargetNon-receptor tyrosine-protein kinase TYK2(Homo sapiens (Human))
TBA
Curated by ChEMBL
LigandPNGBDBM50530394(CHEMBL4561663)
Affinity DataKi:  0.0600nM. Assay description: Inhibition of TYK2 JH2 (unknown origin) by morrison titration assay
Ligand InfoPC cidPC sid
In DepthDetails ArticlePubMed
TargetNon-receptor tyrosine-protein kinase TYK2(Homo sapiens (Human))
TBA
Curated by ChEMBL
LigandPNGBDBM50530394(CHEMBL4561663)
Affinity DataKi:  0.0600nM. Assay description: Inhibition of TYK2 JH2 (unknown origin) by morrison titration assay
Ligand InfoPC cidPC sid
In DepthDetails ArticlePubMed
LigandPNGBDBM50530394(CHEMBL4561663)
Affinity DataIC50:  89nM. Assay description: Inhibition of TYK2/JAK2 in IL23-stimulated human Kit225 cells by steady-glo luciferase assay
Ligand InfoPC cidPC sid
In DepthDetails ArticlePubMed
TargetJAK3/JAK1(Homo sapiens (Human))
TBA
Curated by ChEMBL
LigandPNGBDBM50530394(CHEMBL4561663)
Affinity DataIC50:  400nM. Assay description: Inhibition of JAK1/JAK3 (unknown origin) in IL-2 stimulated cells by cell based assay
Ligand InfoPC cidPC sid
In DepthDetails ArticlePubMed
TargetNon-receptor tyrosine-protein kinase TYK2(Homo sapiens (Human))
TBA
Curated by ChEMBL
LigandPNGBDBM50530394(CHEMBL4561663)
Affinity DataIC50:  0.460nM. Assay description: Inhibition of fluorescein-labeled kinase tracer binding to His-TVMV-fused TYK2 JH2 domain (575 to 869 residues) (unknown origin) measured after 90 mi...
Ligand InfoPC cidPC sid
In DepthDetails ArticlePubMed
TargetNon-receptor tyrosine-protein kinase TYK2(Homo sapiens (Human))
TBA
Curated by ChEMBL
LigandPNGBDBM50530394(CHEMBL4561663)
Affinity DataEC50:  6.60nM. Assay description: Inhibition of TYK2 JH2 (unknown origin) by Scintillation proximity assay
Ligand InfoPC cidPC sid
In DepthDetails ArticlePubMed
TargetNon-receptor tyrosine-protein kinase TYK2(Homo sapiens (Human))
TBA
Curated by ChEMBL
LigandPNGBDBM50530394(CHEMBL4561663)
Affinity DataIC50:  0.460nM. Assay description: Inhibition of fluorescein-labeled kinase tracer binding to His-TVMV-fused TYK2 JH2 domain (575 to 869 residues) (unknown origin) measured after 90 mi...
Ligand InfoPC cidPC sid
In DepthDetails ArticlePubMed
TargetNon-receptor tyrosine-protein kinase TYK2(Homo sapiens (Human))
TBA
Curated by ChEMBL
LigandPNGBDBM50530394(CHEMBL4561663)
Affinity DataIC50:  15nM. Assay description: Inhibition of TYK2 JH1 domain (unknown origin)
Ligand InfoPC cidPC sid
In DepthDetails ArticlePubMed
TargetNon-receptor tyrosine-protein kinase TYK2(Homo sapiens (Human))
TBA
Curated by ChEMBL
LigandPNGBDBM50530394(CHEMBL4561663)
Affinity DataEC50:  6.60nM. Assay description: Inhibition of TYK2 JH2 (unknown origin) by Scintillation proximity assay
Ligand InfoPC cidPC sid
In DepthDetails ArticlePubMed
TargetTyrosine-protein kinase JAK2(Homo sapiens (Human))
TBA
Curated by ChEMBL
LigandPNGBDBM50530394(CHEMBL4561663)
Affinity DataIC50:  24nM. Assay description: Inhibition of JAK2 JH1 domain (unknown origin)
Ligand InfoPC cidPC sid
In DepthDetails ArticlePubMed
LigandPNGBDBM50530394(CHEMBL4561663)
Affinity DataIC50:  89nM. Assay description: Inhibition of TYK2/JAK2 in IL23-stimulated human Kit225 cells by steady-glo luciferase assay
Ligand InfoPC cidPC sid
In DepthDetails ArticlePubMed
LigandPNGBDBM50530394(CHEMBL4561663)
Affinity DataIC50:  37nM. Assay description: Inhibition of TYK2/JAK1 in IFNalpha-stimulated human Kit225 cells by steady-glo luciferase assay
Ligand InfoPC cidPC sid
In DepthDetails ArticlePubMed
TargetJAK3/JAK1(Homo sapiens (Human))
TBA
Curated by ChEMBL
LigandPNGBDBM50530394(CHEMBL4561663)
Affinity DataIC50:  400nM. Assay description: Inhibition of JAK1/JAK3 (unknown origin) in IL-2 stimulated cells by cell based assay
Ligand InfoPC cidPC sid
In DepthDetails ArticlePubMed
TargetTyrosine-protein kinase JAK1/JAK2(Homo sapiens (Human))
TBA
Curated by ChEMBL
LigandPNGBDBM50530394(CHEMBL4561663)
Affinity DataIC50:  210nM. Assay description: Inhibition of JAK1/JAK2 (unknown origin) in GM-CSF stimulated cells by cell based assay
Ligand InfoPC cidPC sid
In DepthDetails ArticlePubMed
LigandPNGBDBM50530394(CHEMBL4561663)
Affinity DataIC50:  37nM. Assay description: Inhibition of TYK2/JAK1 in IFNalpha-stimulated human Kit225 cells by steady-glo luciferase assay
Ligand InfoPC cidPC sid
In DepthDetails ArticlePubMed
TargetTyrosine-protein kinase JAK1/JAK2(Homo sapiens (Human))
TBA
Curated by ChEMBL
LigandPNGBDBM50530394(CHEMBL4561663)
Affinity DataIC50:  210nM. Assay description: Inhibition of JAK1/JAK2 (unknown origin) in GM-CSF stimulated cells by cell based assay
Ligand InfoPC cidPC sid
In DepthDetails ArticlePubMed
TargetTyrosine-protein kinase JAK2(Homo sapiens (Human))
TBA
Curated by ChEMBL
LigandPNGBDBM50530394(CHEMBL4561663)
Affinity DataIC50:  24nM. Assay description: Inhibition of JAK2 JH1 domain (unknown origin)
Ligand InfoPC cidPC sid
In DepthDetails ArticlePubMed
TargetNon-receptor tyrosine-protein kinase TYK2(Homo sapiens (Human))
TBA
Curated by ChEMBL
LigandPNGBDBM50530394(CHEMBL4561663)
Affinity DataIC50:  15nM. Assay description: Inhibition of TYK2 JH1 domain (unknown origin)
Ligand InfoPC cidPC sid
In DepthDetails ArticlePubMed
TargetTyrosine-protein kinase JAK1(Homo sapiens (Human))
TBA
Curated by ChEMBL
LigandPNGBDBM50530394(CHEMBL4561663)
Affinity DataIC50:  26nM. Assay description: Inhibition of JAK1 JH1 domain (unknown origin)
Ligand InfoPC cidPC sid
In DepthDetails ArticlePubMed
TargetTyrosine-protein kinase JAK1(Homo sapiens (Human))
TBA
Curated by ChEMBL
LigandPNGBDBM50530394(CHEMBL4561663)
Affinity DataIC50:  26nM. Assay description: Inhibition of JAK1 JH1 domain (unknown origin)
Ligand InfoPC cidPC sid
In DepthDetails ArticlePubMed