BDBM50531512 CHEMBL4552118
SMILES NS(=O)(=O)c1cc(cs1)-c1nc(no1)-c1ccccc1
InChI Key InChIKey=DNEQUSLFWXCBKT-UHFFFAOYSA-N
Data  4 KI
  Tab Delimited (TSV)   2D SDfile   Computed 3D by Vconf -m prep SDfile
Find this compound or compounds like it in BindingDB:
Activity Spreadsheet -- Enzyme Inhibition Constant Data from BindingDB
Found 4 hits for monomerid = 50531512
TargetCarbonic anhydrase 9(Homo sapiens (Human))
Saint Petersburg State University
Curated by ChEMBL
LigandPNGBDBM50531512(CHEMBL4552118)
Affinity DataKi:  0.240nM. Assay description: Inhibition of human carbonic anhydrase 9 assessed as reduction in CO2 hydration after 15 mins by phenol red staining-based stopped flow assay
Ligand InfoPC cidPC sid
In DepthDetails ArticlePubMed
TargetCarbonic anhydrase 2(Homo sapiens (Human))
Saint Petersburg State University
Curated by ChEMBL
LigandPNGBDBM50531512(CHEMBL4552118)
Affinity DataKi:  1.70nM. Assay description: Inhibition of human carbonic anhydrase 2 assessed as reduction in CO2 hydration after 15 mins by phenol red staining-based stopped flow assay
Ligand InfoPC cidPC sid
In DepthDetails ArticlePubMed
TargetCarbonic anhydrase 1(Homo sapiens (Human))
Saint Petersburg State University
Curated by ChEMBL
LigandPNGBDBM50531512(CHEMBL4552118)
Affinity DataKi:  8.90nM. Assay description: Inhibition of human carbonic anhydrase 1 assessed as reduction in CO2 hydration after 15 mins by phenol red staining-based stopped flow assay
Ligand InfoPC cidPC sid
In DepthDetails ArticlePubMed
TargetCarbonic anhydrase 12(Homo sapiens (Human))
Saint Petersburg State University
Curated by ChEMBL
LigandPNGBDBM50531512(CHEMBL4552118)
Affinity DataKi:  9.80nM. Assay description: Inhibition of human carbonic anhydrase 12 assessed as reduction in CO2 hydration after 15 mins by phenol red staining-based stopped flow assay
Ligand InfoPC cidPC sid
In DepthDetails ArticlePubMed