BDBM50536519 CHEMBL4519232
SMILES C[C@H](c1cc2cccnc2cc1F)n1cnc2ncc(nc12)-c1ccc(C(N)=O)c(F)c1
InChI Key InChIKey=GMFSKAXYGCVANE-GFCCVEGCSA-N
Data  1 EC50
  Tab Delimited (TSV)   2D SDfile   Computed 3D by Vconf -m prep SDfile
Find this compound or compounds like it in BindingDB:
Activity Spreadsheet -- Enzyme Inhibition Constant Data from BindingDB
Found 1 hit for monomerid = 50536519
TargetHepatocyte growth factor receptor(Homo sapiens (Human))
Shanghai Pharmaceuticals Holding
Curated by ChEMBL
LigandPNGBDBM50536519(CHEMBL4519232)
Affinity DataEC50:  2.80nM. Assay description: Inhibition of c-Met kinase (unknown origin) assessed as decrease in phosphorylation of TK substrate-biotin peptide preincubated for 5 to 10 mins foll...
Ligand InfoPC cidPC sid
In DepthDetails ArticlePubMed