BDBM50536543 CHEMBL4483314
SMILES CC(c1c(F)cc2ncccc2c1F)n1cnc2ncc(nc12)-c1cnn(CCO)c1
InChI Key InChIKey=DXDGGLYIMKLRQD-UHFFFAOYSA-N
Data  1 EC50
  Tab Delimited (TSV)   2D SDfile   Computed 3D by Vconf -m prep SDfile
Find this compound or compounds like it in BindingDB:
Activity Spreadsheet -- Enzyme Inhibition Constant Data from BindingDB
Found 1 hit for monomerid = 50536543
TargetHepatocyte growth factor receptor(Homo sapiens (Human))
Shanghai Pharmaceuticals Holding
Curated by ChEMBL
LigandPNGBDBM50536543(CHEMBL4483314)
Affinity DataEC50:  1nM. Assay description: Inhibition of c-Met kinase (unknown origin) assessed as decrease in phosphorylation of TK substrate-biotin peptide preincubated for 5 to 10 mins foll...
Ligand InfoPC cidPC sid
In DepthDetails ArticlePubMed