BDBM50536798 CHEMBL4519011
SMILES C[C@H]1CC[C@H](c2cccs2)S(=O)(=O)N1Cc1ccc(cc1F)N1CCN(CC1)C(C)=O
InChI Key InChIKey=YKOVZHYJTBGHEM-KSFYIVLOSA-N
Data  1 EC50
  Tab Delimited (TSV)   2D SDfile   Computed 3D by Vconf -m prep SDfile
Find this compound or compounds like it in BindingDB:
Activity Spreadsheet -- Enzyme Inhibition Constant Data from BindingDB
Found 1 hit for monomerid = 50536798
TargetNuclear receptor ROR-gamma(Homo sapiens (Human))
Genentech
Curated by ChEMBL
LigandPNGBDBM50536798(CHEMBL4519011)
Affinity DataEC50:  2nM. Assay description: Inverse agonist activity at human RORc-LBD assessed as inhibition of SRC1 co-activator peptide recruitment by FRET assay
Ligand InfoPC cidPC sid
In DepthDetails ArticlePubMed