BDBM50541410 CHEMBL4637301
SMILES F[C@@H]1COCCC11O[C@H](N(CC(=O)Nc2cc3C[C@@]4(Cc3cn2)C(=O)Nc2ncccc42)C1=O)c1cccc(Cl)c1
InChI Key InChIKey=LREUBQQMJXJGNU-KEDVGBLZSA-N
Data  1 KI
  Tab Delimited (TSV)   2D SDfile   Computed 3D by Vconf -m prep SDfile
Find this compound or compounds like it in BindingDB:
Activity Spreadsheet -- Enzyme Inhibition Constant Data from BindingDB
Found 1 hit for monomerid = 50541410
TargetCalcitonin gene-related peptide type 1 receptor/Receptor activity-modifying protein 1(Homo sapiens (Human))
Biohaven Pharmaceuticals
Curated by ChEMBL
LigandPNGBDBM50541410(CHEMBL4637301)
Affinity DataKi:  0.150nM. Assay description: Inhibition of human CLR/RAMP1
Ligand InfoPC cidPC sid
In DepthDetails ArticlePubMed