BDBM50544728 CHEMBL4641474
SMILES CCC(=O)CNC(=O)[C@H](CCc1ccccc1)NC(=O)c1cc(-c2c(OC)cccc2OC)n(CC(C)C)n1
InChI Key InChIKey=FFRROTXFBYUZQR-QHCPKHFHSA-N
Data  1 KI  4 EC50
  Tab Delimited (TSV)   2D SDfile   Computed 3D by Vconf -m prep SDfile
Find this compound or compounds like it in BindingDB:
Activity Spreadsheet -- Enzyme Inhibition Constant Data from BindingDB
Found 5 hits for monomerid = 50544728
TargetApelin receptor(Homo sapiens (Human))
Rti International
Curated by ChEMBL
LigandPNGBDBM50544728(CHEMBL4641474)
Affinity DataKi:  571nM. Assay description: Displacement of [125I]-apelin-13 from human APJ receptor stably expressed in CHOK1 cell membrane measured after 2 hrs by topcount scintillation count...
Ligand InfoPC cidPC sid
In DepthDetails ArticlePubMed
TargetApelin receptor(Homo sapiens (Human))
Rti International
Curated by ChEMBL
LigandPNGBDBM50544728(CHEMBL4641474)
Affinity DataEC50:  162nM. Assay description: Agonist activity at human APJ receptor stably expressed in CHO cells co-expressing Galphaq16 assessed as increase in intracellular calcium mobilizati...
Ligand InfoPC cidPC sid
In DepthDetails ArticlePubMed
TargetApelin receptor(Homo sapiens (Human))
Rti International
Curated by ChEMBL
LigandPNGBDBM50544728(CHEMBL4641474)
Affinity DataEC50:  8.67E+3nM. Assay description: Agonist activity at human APJ receptor stably expressed in CHOK1 cells assessed as induction of beta-arrestin 2 recruitment incubated for 90 mins by ...
Ligand InfoPC cidPC sid
In DepthDetails ArticlePubMed
TargetType-1 angiotensin II receptor(Homo sapiens (Human))
Rti International
Curated by ChEMBL
LigandPNGBDBM50544728(CHEMBL4641474)
Affinity DataEC50: >1.00E+4nM. Assay description: Agonist activity at human AGTR1 stably expressed in CHO cells assessed as increase in intracellular calcium mobilization measured at 1 sec intervals ...
Ligand InfoPC cidPC sid
In DepthDetails ArticlePubMed
TargetApelin receptor(Homo sapiens (Human))
Rti International
Curated by ChEMBL
LigandPNGBDBM50544728(CHEMBL4641474)
Affinity DataEC50: >1.00E+4nM. Assay description: Agonist activity at human APJ receptor stably expressed in CHO cells assessed as inhibition of forskolin-induced cAMP accumulation measured after 30 ...
Ligand InfoPC cidPC sid
In DepthDetails ArticlePubMed