BDBM50574 MLS001005620::N-cyclopropyl-2-(2-furanyl)-4-quinolinecarboxamide::N-cyclopropyl-2-(2-furyl)cinchoninamide::N-cyclopropyl-2-(furan-2-yl)quinoline-4-carboxamide::SMR000348885::cid_2476977
SMILES O=C(NC1CC1)c1cc(nc2ccccc12)-c1ccco1
InChI Key InChIKey=FNZLCZSQWWCSPG-UHFFFAOYSA-N
Data  2 IC50
  Tab Delimited (TSV)   2D SDfile   Computed 3D by Vconf -m prep SDfile
Find this compound or compounds like it in BindingDB:
Activity Spreadsheet -- Enzyme Inhibition Constant Data from BindingDB
Found 2 hits for monomerid = 50574
TargetInduced myeloid leukemia cell differentiation protein Mcl-1(Homo sapiens (Human))
Emory University
Curated by PubChem BioAssay
LigandPNGBDBM50574(MLS001005620 | N-cyclopropyl-2-(2-furanyl)-4-quino...)
Affinity DataIC50:  1.71E+3nM. Assay description: NIH Molecular Libraries Screening Centers Network [MLSCN] Emory Chemical Biology Discovery Center in MLSCN Assay provider: Nikolovska-Coleska, Univer...
In DepthDetails PCBioAssay
TargetGlycoprotein 42(Human herpesvirus 4 type 2)
Emory University
Curated by PubChem BioAssay
LigandPNGBDBM50574(MLS001005620 | N-cyclopropyl-2-(2-furanyl)-4-quino...)
Affinity DataIC50:  3.67E+3nM. Assay description: NIH Molecular Libraries Screening Centers Network [MLSCN] Emory Chemical Biology Discovery Center in MLSCN Assay provider: Theodore Jardetzky; Northw...
In DepthDetails PCBioAssay