BDBM50766 2-amino-6-methyl-4-(2-thienyl)-4a,5,6,7-tetrahydro-4H-naphthalene-1,3,3-tricarbonitrile::2-amino-6-methyl-4-thiophen-2-yl-4a,5,6,7-tetrahydro-4H-naphthalene-1,3,3-tricarbonitrile::2-azanyl-6-methyl-4-thiophen-2-yl-4a,5,6,7-tetrahydro-4H-naphthalene-1,3,3-tricarbonitrile::MLS000034864::SMR000014521::cid_653599
SMILES CC1CCC2=C(C#N)C(=N)C(C#N)(C#N)C(C2C1)c1cccs1
InChI Key InChIKey=NUGRNHGLDVHRAW-UHFFFAOYSA-N
Data  1 IC50  2 EC50
  Tab Delimited (TSV)   2D SDfile   Computed 3D by Vconf -m prep SDfile
Find this compound or compounds like it in BindingDB:
Activity Spreadsheet -- Enzyme Inhibition Constant Data from BindingDB
Found 3 hits for monomerid = 50766
TargetPOsterior Segregation(Caenorhabditis elegans)
Broad Institute
Curated by PubChem BioAssay
LigandPNGBDBM50766(2-amino-6-methyl-4-(2-thienyl)-4a,5,6,7-tetrahydro...)
Affinity DataEC50:  2.17E+4nM. Assay description: Broad Institute: MLPCN maternal gene expression Project ID: 2024 Keywords: Zinc finger, C. elegans, maternal gene expression, RNA-protein interac...
In DepthDetails PCBioAssay
TargetGlycoprotein 42(Human herpesvirus 4 type 2)
Emory University
Curated by PubChem BioAssay
LigandPNGBDBM50766(2-amino-6-methyl-4-(2-thienyl)-4a,5,6,7-tetrahydro...)
Affinity DataIC50:  1.27E+4nM. Assay description: NIH Molecular Libraries Screening Centers Network [MLSCN] Emory Chemical Biology Discovery Center in MLSCN Assay provider: Theodore Jardetzky; Northw...
In DepthDetails PCBioAssay
TargetZinc finger protein mex-5(Caenorhabditis elegans)
Broad Institute
Curated by PubChem BioAssay
LigandPNGBDBM50766(2-amino-6-methyl-4-(2-thienyl)-4a,5,6,7-tetrahydro...)
Affinity DataEC50:  1.49E+4nM. Assay description: Broad Institute: MLPCN maternal gene expression Project ID: 2024 Keywords: Zinc finger, C. elegans, maternal gene expression, RNA-protein interac...
In DepthDetails PCBioAssay