BDBM50867 3-amino-4-phenyl-6,7-dihydro-5H-cyclopenta[b]thieno[3,2-e]pyridine-2-carboxamide::MLS000546820::SMR000115113::cid_1201904
SMILES NC(=O)c1sc2nc3CCCc3c(-c3ccccc3)c2c1N
InChI Key InChIKey=NOJUNBFTWAOWAI-UHFFFAOYSA-N
Data  3 IC50
  Tab Delimited (TSV)   2D SDfile   Computed 3D by Vconf -m prep SDfile
Find this compound or compounds like it in BindingDB:
Activity Spreadsheet -- Enzyme Inhibition Constant Data from BindingDB
Found 3 hits for monomerid = 50867
TargetGlycoprotein 42(Human herpesvirus 4 type 2)
Emory University
Curated by PubChem BioAssay
LigandPNGBDBM50867(3-amino-4-phenyl-6,7-dihydro-5H-cyclopenta[b]thien...)
Affinity DataIC50:  7.15E+3nM. Assay description: NIH Molecular Libraries Screening Centers Network [MLSCN] Emory Chemical Biology Discovery Center in MLSCN Assay provider: Theodore Jardetzky; Northw...
In DepthDetails PCBioAssay
TargetPhospholipase A2(Homo sapiens (Human))
Burnham Center For Chemical Genomics
Curated by PubChem BioAssay
LigandPNGBDBM50867(3-amino-4-phenyl-6,7-dihydro-5H-cyclopenta[b]thien...)
Affinity DataIC50:  8.38E+3nM. Assay description: Data Source: Sanford-Burnham Center for Chemical Genomics (SBCCG) Source Affiliation: Sanford-Burnham Medical Research Institute (SBMRI, San Diego, C...
In DepthDetails PCBioAssay
TargetCysteine protease ATG4B(Homo sapiens (Human))
Burnham Center For Chemical Genomics
Curated by PubChem BioAssay
LigandPNGBDBM50867(3-amino-4-phenyl-6,7-dihydro-5H-cyclopenta[b]thien...)
Affinity DataIC50:  1.23E+4nM. Assay description: Data Source: Sanford-Burnham Center for Chemical Genomics (SBCCG) Source Affiliation: Sanford-Burnham Medical Research Institute (SBMRI, San Diego, C...
In DepthDetails PCBioAssay