BDBM51216 (E)-2-cyano-3-(2-piperidino-3-quinolyl)acrylic acid ethyl ester::(E)-2-cyano-3-[2-(1-piperidinyl)-3-quinolinyl]-2-propenoic acid ethyl ester::MLS001017600::SMR000353813::cid_5637963::ethyl (E)-2-cyano-3-(2-piperidin-1-ylquinolin-3-yl)prop-2-enoate
SMILES CCOC(=O)C(=C\c1cc2ccccc2nc1N1CCCCC1)\C#N
InChI Key InChIKey=HAFDMQYCXZVSSA-GHRIWEEISA-N
Data  1 IC50  2 EC50
  Tab Delimited (TSV)   2D SDfile   Computed 3D by Vconf -m prep SDfile
Find this compound or compounds like it in BindingDB:
Activity Spreadsheet -- Enzyme Inhibition Constant Data from BindingDB
Found 3 hits for monomerid = 51216
TargetGlycoprotein 42(Human herpesvirus 4 type 2)
Emory University
Curated by PubChem BioAssay
LigandPNGBDBM51216((E)-2-cyano-3-(2-piperidino-3-quinolyl)acrylic aci...)
Affinity DataIC50:  1.55E+4nM. Assay description: NIH Molecular Libraries Screening Centers Network [MLSCN] Emory Chemical Biology Discovery Center in MLSCN Assay provider: Theodore Jardetzky; Northw...
In DepthDetails PCBioAssay
TargetZinc finger protein mex-5(Caenorhabditis elegans)
Broad Institute
Curated by PubChem BioAssay
LigandPNGBDBM51216((E)-2-cyano-3-(2-piperidino-3-quinolyl)acrylic aci...)
Affinity DataEC50:  1.04E+5nM. Assay description: Broad Institute: MLPCN maternal gene expression Project ID: 2024 Keywords: Zinc finger, C. elegans, maternal gene expression, RNA-protein interac...
In DepthDetails PCBioAssay
TargetPOsterior Segregation(Caenorhabditis elegans)
Broad Institute
Curated by PubChem BioAssay
LigandPNGBDBM51216((E)-2-cyano-3-(2-piperidino-3-quinolyl)acrylic aci...)
Affinity DataEC50:  3.00E+5nM. Assay description: Broad Institute: MLPCN maternal gene expression Project ID: 2024 Keywords: Zinc finger, C. elegans, maternal gene expression, RNA-protein interac...
In DepthDetails PCBioAssay