BDBM51268 Acetic acid 3-oxo-2-[1-pyridin-4-yl-meth-(Z)-ylidene]-2,3-dihydro-benzofuran-6-yl ester::MLS000333738::SMR000437872::[(2Z)-3-oxidanylidene-2-(pyridin-4-ylmethylidene)-1-benzofuran-6-yl] ethanoate::[(2Z)-3-oxo-2-(pyridin-4-ylmethylidene)-1-benzofuran-6-yl] acetate::acetic acid [(2Z)-3-keto-2-(4-pyridylmethylene)coumaran-6-yl] ester::acetic acid [(2Z)-3-oxo-2-(pyridin-4-ylmethylidene)-6-benzofuranyl] ester::cid_2001682
SMILES CC(=O)Oc1ccc2C(=O)\C(Oc2c1)=C\c1ccncc1
InChI Key InChIKey=YMQWSBGHUALGMG-NVNXTCNLSA-N
Data  1 IC50
  Tab Delimited (TSV)   2D SDfile   Computed 3D by Vconf -m prep SDfile
Find this compound or compounds like it in BindingDB:
Activity Spreadsheet -- Enzyme Inhibition Constant Data from BindingDB
Found 1 hit for monomerid = 51268
TargetGlycoprotein 42(Human herpesvirus 4 type 2)
Emory University
Curated by PubChem BioAssay
LigandPNGBDBM51268(Acetic acid 3-oxo-2-[1-pyridin-4-yl-meth-(Z)-ylide...)
Affinity DataIC50:  3.68E+3nM. Assay description: NIH Molecular Libraries Screening Centers Network [MLSCN] Emory Chemical Biology Discovery Center in MLSCN Assay provider: Theodore Jardetzky; Northw...
In DepthDetails PCBioAssay