BDBM51314 (6-chloranyl-2-phenyl-chromen-4-ylidene)-(2,2,6,6-tetramethylpiperidin-4-yl)azanium;tetrafluoroborate::(6-chloro-2-phenyl-1-benzopyran-4-ylidene)-(2,2,6,6-tetramethyl-4-piperidinyl)ammonium;tetrafluoroborate::(6-chloro-2-phenyl-chromen-4-ylidene)-(2,2,6,6-tetramethyl-4-piperidyl)ammonium;tetrafluoroborate::(6-chloro-2-phenylchromen-4-ylidene)-(2,2,6,6-tetramethylpiperidin-4-yl)azanium;tetrafluoroborate::MLS000727607::N-[(4E)-6-chloro-2-phenyl-4H-chromen-4-ylidene]-2,2,6,6-tetramethylpiperidin-4-aminium::SMR000306304::cid_16188549
SMILES CC1(C)CC(CC(C)(C)N1)\[NH+]=c1/cc(oc2ccc(Cl)cc12)-c1ccccc1
InChI Key InChIKey=KMGDKZROVQMFQA-LHLOQNFPSA-O
Data  3 IC50
  Tab Delimited (TSV)   2D SDfile   Computed 3D by Vconf -m prep SDfile
Find this compound or compounds like it in BindingDB:
Activity Spreadsheet -- Enzyme Inhibition Constant Data from BindingDB
Found 3 hits for monomerid = 51314
TargetDNA repair protein RAD51 homolog 1(Homo sapiens (Human))
Pcmd
Curated by PubChem BioAssay
LigandPNGBDBM51314((6-chloranyl-2-phenyl-chromen-4-ylidene)-(2,2,6,6-...)
Affinity DataIC50:  3.66E+3nM. Assay description: Project Title: A screen for modulators of human Rad51, a key DNA repair protein Application Number: MH084119 Assay Submitter: Dr. Alex Mazin Submitte...
In DepthDetails PCBioAssay
TargetDNA (cytosine-5)-methyltransferase 1(Homo sapiens (Human))
Burnham Center For Chemical Genomics
Curated by PubChem BioAssay
LigandPNGBDBM51314((6-chloranyl-2-phenyl-chromen-4-ylidene)-(2,2,6,6-...)
Affinity DataIC50: >9.90E+4nM. Assay description: Data Source: Sanford-Burnham Center for Chemical Genomics (SBCCG) Source Affiliation: Sanford-Burnham Medical Research Institute (SBMRI, San Diego, C...
In DepthDetails PCBioAssay
TargetDNA repair protein RAD51 homolog 1(Homo sapiens (Human))
Pcmd
Curated by PubChem BioAssay
LigandPNGBDBM51314((6-chloranyl-2-phenyl-chromen-4-ylidene)-(2,2,6,6-...)
Affinity DataIC50:  1.47E+4nM. Assay description: Project Title: A screen for modulators of human Rad51, a key DNA repair protein Application Number: MH084119 Assay Submitter: Dr. Alex Mazin Submitte...
In DepthDetails PCBioAssay