BDBM51351 1,4-diphenyl-4,7-dihydro-3H-furo[3,4-b]pyridine-2,5-dione::1,4-diphenyl-4,7-dihydro-3H-furo[3,4-b]pyridine-2,5-quinone::1,4-diphenyl-4,7-dihydrofuro[3,4-b]pyridine-2,5(1H,3H)-dione::MLS000681577::SMR000312254::cid_4920416
SMILES O=C1OCC2=C1C(CC(=O)N2c1ccccc1)c1ccccc1
InChI Key InChIKey=SODYPYQMKKIOKU-UHFFFAOYSA-N
Data  1 IC50
  Tab Delimited (TSV)   2D SDfile   Computed 3D by Vconf -m prep SDfile
Find this compound or compounds like it in BindingDB:
Activity Spreadsheet -- Enzyme Inhibition Constant Data from BindingDB
Found 1 hit for monomerid = 51351
TargetDNA repair protein RAD51 homolog 1(Homo sapiens (Human))
Pcmd
Curated by PubChem BioAssay
LigandPNGBDBM51351(1,4-diphenyl-4,7-dihydro-3H-furo[3,4-b]pyridine-2,...)
Affinity DataIC50:  5.30E+4nM. Assay description: Project Title: A screen for modulators of human Rad51, a key DNA repair protein Application Number: MH084119 Assay Submitter: Dr. Alex Mazin Submitte...
In DepthDetails PCBioAssay